{"text_format":"1","workbook":"xlsx","n_sheets":3,"sheets":["Order Sheet","Fabrics","Formula"],"not_rendered":{"charts":0,"images":1,"macros":1,"external_links":0,"defined_names":9,"comments":1,"pivot_tables":0},"unopened":[],"bounds":{"document_bytes":16777216,"sheet_cells":100000,"rows_first":2000,"rows_last":500,"rows_between":2000,"halvings":0,"cell_chars":16384,"cell_head_chars":4096},"cells_cut":0,"cells_raw":0,"read":"whole","date_system":"1900"}

{"sheet":"Order Sheet","index":0,"n_rows":7,"n_cols":15,"rows_kept":7,"cut":false,"hidden":false,"merged":[[0,2,0,3]]}
[null,null,"Commercial Quote/Order Form",null,null,null,null,null,"Type","Fabric","Color","Supplier","Code"]
[null,null,null,null,null,null,null,"Fabric 1:","Blockout"]
[null,null,null,null,null,null,null,"Fabric 2:","Screen"]
[null,"Job Number :",null,"XX",null,null,null,"Fabric 3:","Blockout"]
[null,null,null,null,null,null,null,"Fabric 4:","Screen"]
[]
["Width","Drop","Fabric Description","Room Description 12 Characters Max","Mount Type","Roll Type","Control Side","Control Color","Chain Type","Chain Length","Bottom Rail","Bottom Rail Color","Helper Type","Bracket / System","Other Options"]

{"sheet":"Fabrics","index":1,"n_rows":51,"n_cols":36,"rows_kept":51,"cut":false,"hidden":false,"merged":[[0,4,0,43]]}
["Sort Fabric Name A->Z","TYPE","FABRIC NAME ","SUPPLIER","Colors"]
[null,"Blockout","Aston","Shaw","Almond","Bark","Buff","Chalk","Fig","Ink","Moss","Oatcake"]
[null,"Blockout","Bauhaus","Basford","Dawn","Dove","Dusk","Pepper","Shell","Smoke"]
[null,"Blockout","Boston Blockout","Wilson","Buffalo","Charcoal","Chinchilla","Marshmello","Quartz"," Shark","Silver","Stone"]
[null,"Translucent","Boston Translucent","Wilson","Buffalo","Charcoal","Chinchilla","Marshmellow","Quartz","Shark","Silver","Stone"]
[null,"Blockout","Centro","Hunter Douglas","Barley","Charcoal Black","Dark Grey","Dove","Midnight","Pearl","Shell","Stone","Winter White"]
[null,"Blockout","Clovelly Blockout","Hunter Douglas","Alabaster","Boardwalk","Cobblestone","Granite","Midnight","Paperbark","White"]
[null,"Translucent","Clovelly Transucent","Hunter Douglas","Cobblestone","Midnight","Paperbark","White"]
[null,"Blockout","Concord Blockout","Wilson","Ash","Cafe","Egret","Ivory","Pebble","Slate","Stone"]
[null,"Translucent","Concord Translucent","Wilson","Ash","Cafe","Egret","Ivory","Pebble","Slate","Stone"]
[null,"Blockout","Duoblock","Shaw","Aztec","Basalt","Dove","Iron","Nova","Salt","Shadow","Stella","Tempo"]
[null,"Screen","DuoScreen","Shaw","Blue Grey","Charcoal","Charcoal Grey","Charcoal Slate","Dune Grey","Ice White","White","White Grey","White Linen","White Stone"]
[null,"Screen","E-Screen 10% Open-Virtual Screen","Hunter Douglas","Charcoal","Charcoal Cocoa","Pearl","White","White Linen"]
[null,"Screen","E-Screen 5% Open-Clear Screen","Hunter Douglas","Charcoal","Charcoal Cocoa","Charcoal Grey","Pearl Linen","White","White Linen","White Pearl"]
[null,"Blockout","Icon","Shaw","Angel","Arena","Calico","Canyon","Earth","Flint","Manilla","Night","Spritz","Stone"]
[null,"Blockout","Icon FR","Shaw","Ceylon","Flora","Harbour","Jet","Leather","Liquorice","Maritime","Osprey","Papyrus","Sail","Sculpture","Sea Mist","Solar","Stonewash","Taurus"]
[null,"Blockout","Karma","Shaw","Cliff","Dew","Frost","Glade","Haze","Magma","Moonscape","Ocean","Petrol","Rock","Sandstone","Shell"]
[null,"Blockout","LeReve Blockout","Shaw","Chalk","Concrete","Crystal","Graphite","Marble","Mink","Onyx","Pewter","Sand","Shell"]
[null,"Translucent","LeReve Translucent","Shaw","Chalk","Concrete","Crystal","Graphite","Marble","Mink","Onyx","Pewter","Sand","Shell"]
[null,"Translucent","Linesque Trans","Shaw","Chestnut","Delta","Granite","Hazel","Levi","Lily","Oatcake","Owl","Stonewash","Trellis","Wicker","Winter"]
[null,"Blockout","LinesqueBO","Shaw","Almond","Aspen","Blanco","Breeze","Denim","Dove","Fig","Fleece","Fossil","Raffia","Soba","Vine"]
[null,"Blockout","Mantra Blockout","Shaw","Cotton","Flint","Opal","Parchment","Pebble","Seagrass","Seed Pearl","Sesame","Shale"]
[null,"Translucent","Mantra Translucent","Shaw","Cotton","Parchment","Pebble","Seagrass","Seed Pearl","Sesame","Shale"]
[null,"Blockout","Matka","Basford","Alabaster","Chalk","Granite","Marble","Onyx","Putty"]
[null,"Screen","M-Screen 5% Open-Clear Screen","Hunter Douglas","Charcoal","Charcoal Grey","Charcoal Sable","White","White Linen","White Stone",null,null,null,null,"     "]
[null,"Screen","Net Series","Hunter Douglas","Ash Linen","Ash Midnight Bronze","Charcoal","Charcoal Bronze","Charcoal Grey","Charcoal Light Grey","Grey","Midnight Magnetic Stone","Midnight Tan Stone","Pearl Magnetic Bronze","Pearl White","Sable Ash Pearl","Sable Shale","Wh Sable Gy","Wh Wh Sable","White","White Grey","White Linen","White Pearl","White Sable"]
[null,"Blockout","Palau Blockout","Hunter Douglas","Dusk","Linen","Midnight","Sable","Shale","White","White Pearl"]
[null,"Translucent","Palm Beach Translucent","Shaw","Angora","Calico","Eve","Fennel","Fresh","Horizon","Ink","Jumbo","Melody","Monsoon","Pearl","Steel"]
[null,"Blockout","PalmBeach","Shaw","Dusk","Gull","Horizon","Ink","Iron","Jasmine","Lyric","Melody","Merino","Monsoon","Pearl","Porpoise","Quartz","Steel","SummerStorm","Thunder","Urban"]
[null,"Screen","Picturesque 3% Open-Privacy Screen","Blindware","Bronze","Charcoal","Charcoal Apricot","Charcoal Bronze","Charcoal Grey","Charcoal Sand","Grey","Linen","White","White Grey","White Linen","White Stone"]
{"$rows_left_out":22}
{"sheet":"Formula","index":2,"n_rows":60,"n_cols":14,"rows_kept":60,"cut":false,"hidden":false,"merged":[[16,5,16,6],[16,7,16,8],[16,9,16,10],[16,11,16,12]]}
[]
[]
[]
[]
[]
[null,null,null,null,null,null,null,null,null,null,null,null,null,{"$f":"IFERROR(VLOOKUP(G$19,Fabrics!$C$2:$AA$5001,ROWS(Fabrics!$A$1:A4),FALSE),\"\")","v":""}]
[]
[]
[null,null,null,null,null,"User chosen type","User chosen fabric","User chosen type","User chosen fabric","User chosen type","User chosen fabric","User chosen type","User chosen fabric"]
[null,null,null,null,"Range",{"$f":"ROWS(F21:F60)*COLUMNS(F21:F60)-COUNTBLANK(F21:F60)+$F$11","v":47},20,34,20,47,20,34,20]
[null,null,null,null,"Offset",20,null,20,null,20,null,20]
[null,null,null,null,null,{"$f":"\"Formula!F21:\"","v":"Formula!F21:"},{"$f":"\"Formula!G21:\"","v":"Formula!G21:"},{"$f":"\"Formula!H21:\"","v":"Formula!H21:"},{"$f":"\"Formula!I21:\"","v":"Formula!I21:"},{"$f":"\"Formula!J21:\"","v":"Formula!J21:"},{"$f":"\"Formula!K21:\"","v":"Formula!K21:"},{"$f":"\"Formula!L21:\"","v":"Formula!L21:"},{"$f":"\"Formula!M21:\"","v":"Formula!M21:"}]
[null,null,null,null,null,{"$f":"F12&\"F\"&F10","v":"Formula!F21:F47"},{"$f":"G12&\"G\"&G10","v":"Formula!G21:G20"},{"$f":"H12&\"H\"&H10","v":"Formula!H21:H34"},{"$f":"I12&\"I\"&I10","v":"Formula!I21:I20"},{"$f":"J12&\"J\"&J10","v":"Formula!J21:J47"},{"$f":"K12&\"K\"&K10","v":"Formula!K21:K20"},{"$f":"L12&\"L\"&L10","v":"Formula!L21:L34"},{"$f":"M12&\"M\"&M10","v":"Formula!M21:M20"}]
[]
[]
[]
[null,null,null,null,null,1,null,2,null,3,null,4]
[null,null,null,null,null,"User chosen type","User chosen fabric","User chosen type","User chosen fabric","User chosen type","User chosen fabric","User chosen type","User chosen fabric"]
[null,null,null,null,null,{"$f":"'Order Sheet'!I$2","v":"Blockout"},{"$f":"'Order Sheet'!J$2","v":0},{"$f":"'Order Sheet'!$I$3","v":"Screen"},{"$f":"'Order Sheet'!$J$3","v":0},{"$f":"'Order Sheet'!$I$4","v":"Blockout"},{"$f":"'Order Sheet'!$J$4","v":0},{"$f":"'Order Sheet'!$I$5","v":"Screen"},{"$f":"'Order Sheet'!$J$5","v":0}]
[null,null,null,null,null,"FABRIC","COLOUR","FABRIC","COLOUR","FABRIC","COLOUR","FABRIC","COLOUR"]
[null,null,null,null,null,{"$f":"IFERROR(INDEX(Fabrics!$C$2:$C$5001,SMALL(IF(F$19=Fabrics!$B$2:$B$5001,MATCH(ROW(Fabrics!$B$2:$B$5001),ROW(Fabrics!$B$2:$B5001)),\"\"),ROWS(Fabrics!$A$1:A1))),\"\")","v":"Aston"},{"$f":"IFERROR(VLOOKUP(G$19,Fabrics!$C$2:$AR$5001,ROWS(Fabrics!$A$1:A3),FALSE),\"\")","v":""},{"$f":"IFERROR(INDEX(Fabrics!$C$2:$C$5001,SMALL(IF(H$19=Fabrics!$B$2:$B$5001,MATCH(ROW(Fabrics!$B$2:$B$5001),ROW(Fabrics!$B$2:$B5001)),\"\"),ROWS(Fabrics!$A$1:D1))),\"\")","v":"DuoScreen"},{"$f":"IFERROR(VLOOKUP(I$19,Fabrics!$C$2:$AR$5001,ROWS(Fabrics!$A$1:C3),FALSE),\"\")","v":""},{"$f":"IFERROR(INDEX(Fabrics!$C$2:$C$5001,SMALL(IF(J$19=Fabrics!$B$2:$B$5001,MATCH(ROW(Fabrics!$B$2:$B$5001),ROW(Fabrics!$B$2:$B5001)),\"\"),ROWS(Fabrics!$A$1:E1))),\"\")","v":"Aston"},{"$f":"IFERROR(VLOOKUP(K$19,Fabrics!$C$2:$AR$5001,ROWS(Fabrics!$A$1:E3),FALSE),\"\")","v":""},{"$f":"IFERROR(INDEX(Fabrics!$C$2:$C$5001,SMALL(IF(L$19=Fabrics!$B$2:$B$5001,MATCH(ROW(Fabrics!$B$2:$B$5001),ROW(Fabrics!$B$2:$B5001)),\"\"),ROWS(Fabrics!$A$1:G1))),\"\")","v":"DuoScreen"},{"$f":"IFERROR(VLOOKUP(M$19,Fabrics!$C$2:$AR$5001,ROWS(Fabrics!$A$1:G3),FALSE),\"\")","v":""}]
[null,null,null,null,null,{"$f":"IFERROR(INDEX(Fabrics!$C$2:$C$5001,SMALL(IF(F$19=Fabrics!$B$2:$B$5001,MATCH(ROW(Fabrics!$B$2:$B$5001),ROW(Fabrics!$B$2:$B5002)),\"\"),ROWS(Fabrics!$A$1:A2))),\"\")","v":"Bauhaus"},{"$f":"IFERROR(VLOOKUP(G$19,Fabrics!$C$2:$AR$5001,ROWS(Fabrics!$A$1:A4),FALSE),\"\")","v":""},{"$f":"IFERROR(INDEX(Fabrics!$C$2:$C$5001,SMALL(IF(H$19=Fabrics!$B$2:$B$5001,MATCH(ROW(Fabrics!$B$2:$B$5001),ROW(Fabrics!$B$2:$B5002)),\"\"),ROWS(Fabrics!$A$1:D2))),\"\")","v":"E-Screen 10% Open-Virtual Screen"},{"$f":"IFERROR(VLOOKUP(I$19,Fabrics!$C$2:$AR$5001,ROWS(Fabrics!$A$1:C4),FALSE),\"\")","v":""},{"$f":"IFERROR(INDEX(Fabrics!$C$2:$C$5001,SMALL(IF(J$19=Fabrics!$B$2:$B$5001,MATCH(ROW(Fabrics!$B$2:$B$5001),ROW(Fabrics!$B$2:$B5002)),\"\"),ROWS(Fabrics!$A$1:E2))),\"\")","v":"Bauhaus"},{"$f":"IFERROR(VLOOKUP(K$19,Fabrics!$C$2:$AR$5001,ROWS(Fabrics!$A$1:E4),FALSE),\"\")","v":""},{"$f":"IFERROR(INDEX(Fabrics!$C$2:$C$5001,SMALL(IF(L$19=Fabrics!$B$2:$B$5001,MATCH(ROW(Fabrics!$B$2:$B$5001),ROW(Fabrics!$B$2:$B5002)),\"\"),ROWS(Fabrics!$A$1:G2))),\"\")","v":"E-Screen 10% Open-Virtual Screen"},{"$f":"IFERROR(VLOOKUP(M$19,Fabrics!$C$2:$AR$5001,ROWS(Fabrics!$A$1:G4),FALSE),\"\")","v":""}]
[null,null,null,null,null,{"$f":"IFERROR(INDEX(Fabrics!$C$2:$C$5001,SMALL(IF(F$19=Fabrics!$B$2:$B$5001,MATCH(ROW(Fabrics!$B$2:$B$5001),ROW(Fabrics!$B$2:$B5003)),\"\"),ROWS(Fabrics!$A$1:A3))),\"\")","v":"Boston Blockout"},{"$f":"IFERROR(VLOOKUP(G$19,Fabrics!$C$2:$AR$5001,ROWS(Fabrics!$A$1:A5),FALSE),\"\")","v":""},{"$f":"IFERROR(INDEX(Fabrics!$C$2:$C$5001,SMALL(IF(H$19=Fabrics!$B$2:$B$5001,MATCH(ROW(Fabrics!$B$2:$B$5001),ROW(Fabrics!$B$2:$B5003)),\"\"),ROWS(Fabrics!$A$1:D3))),\"\")","v":"E-Screen 5% Open-Clear Screen"},{"$f":"IFERROR(VLOOKUP(I$19,Fabrics!$C$2:$AR$5001,ROWS(Fabrics!$A$1:C5),FALSE),\"\")","v":""},{"$f":"IFERROR(INDEX(Fabrics!$C$2:$C$5001,SMALL(IF(J$19=Fabrics!$B$2:$B$5001,MATCH(ROW(Fabrics!$B$2:$B$5001),ROW(Fabrics!$B$2:$B5003)),\"\"),ROWS(Fabrics!$A$1:E3))),\"\")","v":"Boston Blockout"},{"$f":"IFERROR(VLOOKUP(K$19,Fabrics!$C$2:$AR$5001,ROWS(Fabrics!$A$1:E5),FALSE),\"\")","v":""},{"$f":"IFERROR(INDEX(Fabrics!$C$2:$C$5001,SMALL(IF(L$19=Fabrics!$B$2:$B$5001,MATCH(ROW(Fabrics!$B$2:$B$5001),ROW(Fabrics!$B$2:$B5003)),\"\"),ROWS(Fabrics!$A$1:G3))),\"\")","v":"E-Screen 5% Open-Clear Screen"},{"$f":"IFERROR(VLOOKUP(M$19,Fabrics!$C$2:$AR$5001,ROWS(Fabrics!$A$1:G5),FALSE),\"\")","v":""}]
[null,null,null,null,null,{"$f":"IFERROR(INDEX(Fabrics!$C$2:$C$5001,SMALL(IF(F$19=Fabrics!$B$2:$B$5001,MATCH(ROW(Fabrics!$B$2:$B$5001),ROW(Fabrics!$B$2:$B5004)),\"\"),ROWS(Fabrics!$A$1:A4))),\"\")","v":"Centro"},{"$f":"IFERROR(VLOOKUP(G$19,Fabrics!$C$2:$AR$5001,ROWS(Fabrics!$A$1:A6),FALSE),\"\")","v":""},{"$f":"IFERROR(INDEX(Fabrics!$C$2:$C$5001,SMALL(IF(H$19=Fabrics!$B$2:$B$5001,MATCH(ROW(Fabrics!$B$2:$B$5001),ROW(Fabrics!$B$2:$B5004)),\"\"),ROWS(Fabrics!$A$1:D4))),\"\")","v":"M-Screen 5% Open-Clear Screen"},{"$f":"IFERROR(VLOOKUP(I$19,Fabrics!$C$2:$AR$5001,ROWS(Fabrics!$A$1:C6),FALSE),\"\")","v":""},{"$f":"IFERROR(INDEX(Fabrics!$C$2:$C$5001,SMALL(IF(J$19=Fabrics!$B$2:$B$5001,MATCH(ROW(Fabrics!$B$2:$B$5001),ROW(Fabrics!$B$2:$B5004)),\"\"),ROWS(Fabrics!$A$1:E4))),\"\")","v":"Centro"},{"$f":"IFERROR(VLOOKUP(K$19,Fabrics!$C$2:$AR$5001,ROWS(Fabrics!$A$1:E6),FALSE),\"\")","v":""},{"$f":"IFERROR(INDEX(Fabrics!$C$2:$C$5001,SMALL(IF(L$19=Fabrics!$B$2:$B$5001,MATCH(ROW(Fabrics!$B$2:$B$5001),ROW(Fabrics!$B$2:$B5004)),\"\"),ROWS(Fabrics!$A$1:G4))),\"\")","v":"M-Screen 5% Open-Clear Screen"},{"$f":"IFERROR(VLOOKUP(M$19,Fabrics!$C$2:$AR$5001,ROWS(Fabrics!$A$1:G6),FALSE),\"\")","v":""}]
[null,null,null,null,null,{"$f":"IFERROR(INDEX(Fabrics!$C$2:$C$5001,SMALL(IF(F$19=Fabrics!$B$2:$B$5001,MATCH(ROW(Fabrics!$B$2:$B$5001),ROW(Fabrics!$B$2:$B5005)),\"\"),ROWS(Fabrics!$A$1:A5))),\"\")","v":"Clovelly Blockout"},{"$f":"IFERROR(VLOOKUP(G$19,Fabrics!$C$2:$AR$5001,ROWS(Fabrics!$A$1:A7),FALSE),\"\")","v":""},{"$f":"IFERROR(INDEX(Fabrics!$C$2:$C$5001,SMALL(IF(H$19=Fabrics!$B$2:$B$5001,MATCH(ROW(Fabrics!$B$2:$B$5001),ROW(Fabrics!$B$2:$B5005)),\"\"),ROWS(Fabrics!$A$1:D5))),\"\")","v":"Net Series"},{"$f":"IFERROR(VLOOKUP(I$19,Fabrics!$C$2:$AR$5001,ROWS(Fabrics!$A$1:C7),FALSE),\"\")","v":""},{"$f":"IFERROR(INDEX(Fabrics!$C$2:$C$5001,SMALL(IF(J$19=Fabrics!$B$2:$B$5001,MATCH(ROW(Fabrics!$B$2:$B$5001),ROW(Fabrics!$B$2:$B5005)),\"\"),ROWS(Fabrics!$A$1:E5))),\"\")","v":"Clovelly Blockout"},{"$f":"IFERROR(VLOOKUP(K$19,Fabrics!$C$2:$AR$5001,ROWS(Fabrics!$A$1:E7),FALSE),\"\")","v":""},{"$f":"IFERROR(INDEX(Fabrics!$C$2:$C$5001,SMALL(IF(L$19=Fabrics!$B$2:$B$5001,MATCH(ROW(Fabrics!$B$2:$B$5001),ROW(Fabrics!$B$2:$B5005)),\"\"),ROWS(Fabrics!$A$1:G5))),\"\")","v":"Net Series"},{"$f":"IFERROR(VLOOKUP(M$19,Fabrics!$C$2:$AR$5001,ROWS(Fabrics!$A$1:G7),FALSE),\"\")","v":""}]
[null,null,null,null,null,{"$f":"IFERROR(INDEX(Fabrics!$C$2:$C$5001,SMALL(IF(F$19=Fabrics!$B$2:$B$5001,MATCH(ROW(Fabrics!$B$2:$B$5001),ROW(Fabrics!$B$2:$B5006)),\"\"),ROWS(Fabrics!$A$1:A6))),\"\")","v":"Concord Blockout"},{"$f":"IFERROR(VLOOKUP(G$19,Fabrics!$C$2:$AR$5001,ROWS(Fabrics!$A$1:A8),FALSE),\"\")","v":""},{"$f":"IFERROR(INDEX(Fabrics!$C$2:$C$5001,SMALL(IF(H$19=Fabrics!$B$2:$B$5001,MATCH(ROW(Fabrics!$B$2:$B$5001),ROW(Fabrics!$B$2:$B5006)),\"\"),ROWS(Fabrics!$A$1:D6))),\"\")","v":"Picturesque 3% Open-Privacy Screen"},{"$f":"IFERROR(VLOOKUP(I$19,Fabrics!$C$2:$AR$5001,ROWS(Fabrics!$A$1:C8),FALSE),\"\")","v":""},{"$f":"IFERROR(INDEX(Fabrics!$C$2:$C$5001,SMALL(IF(J$19=Fabrics!$B$2:$B$5001,MATCH(ROW(Fabrics!$B$2:$B$5001),ROW(Fabrics!$B$2:$B5006)),\"\"),ROWS(Fabrics!$A$1:E6))),\"\")","v":"Concord Blockout"},{"$f":"IFERROR(VLOOKUP(K$19,Fabrics!$C$2:$AR$5001,ROWS(Fabrics!$A$1:E8),FALSE),\"\")","v":""},{"$f":"IFERROR(INDEX(Fabrics!$C$2:$C$5001,SMALL(IF(L$19=Fabrics!$B$2:$B$5001,MATCH(ROW(Fabrics!$B$2:$B$5001),ROW(Fabrics!$B$2:$B5006)),\"\"),ROWS(Fabrics!$A$1:G6))),\"\")","v":"Picturesque 3% Open-Privacy Screen"},{"$f":"IFERROR(VLOOKUP(M$19,Fabrics!$C$2:$AR$5001,ROWS(Fabrics!$A$1:G8),FALSE),\"\")","v":""}]
[null,null,null,null,null,{"$f":"IFERROR(INDEX(Fabrics!$C$2:$C$5001,SMALL(IF(F$19=Fabrics!$B$2:$B$5001,MATCH(ROW(Fabrics!$B$2:$B$5001),ROW(Fabrics!$B$2:$B5007)),\"\"),ROWS(Fabrics!$A$1:A7))),\"\")","v":"Duoblock"},{"$f":"IFERROR(VLOOKUP(G$19,Fabrics!$C$2:$AR$5001,ROWS(Fabrics!$A$1:A9),FALSE),\"\")","v":""},{"$f":"IFERROR(INDEX(Fabrics!$C$2:$C$5001,SMALL(IF(H$19=Fabrics!$B$2:$B$5001,MATCH(ROW(Fabrics!$B$2:$B$5001),ROW(Fabrics!$B$2:$B5007)),\"\"),ROWS(Fabrics!$A$1:D7))),\"\")","v":"Picturesque 5% Open-Clear Screen"},{"$f":"IFERROR(VLOOKUP(I$19,Fabrics!$C$2:$AR$5001,ROWS(Fabrics!$A$1:C9),FALSE),\"\")","v":""},{"$f":"IFERROR(INDEX(Fabrics!$C$2:$C$5001,SMALL(IF(J$19=Fabrics!$B$2:$B$5001,MATCH(ROW(Fabrics!$B$2:$B$5001),ROW(Fabrics!$B$2:$B5007)),\"\"),ROWS(Fabrics!$A$1:E7))),\"\")","v":"Duoblock"},{"$f":"IFERROR(VLOOKUP(K$19,Fabrics!$C$2:$AR$5001,ROWS(Fabrics!$A$1:E9),FALSE),\"\")","v":""},{"$f":"IFERROR(INDEX(Fabrics!$C$2:$C$5001,SMALL(IF(L$19=Fabrics!$B$2:$B$5001,MATCH(ROW(Fabrics!$B$2:$B$5001),ROW(Fabrics!$B$2:$B5007)),\"\"),ROWS(Fabrics!$A$1:G7))),\"\")","v":"Picturesque 5% Open-Clear Screen"},{"$f":"IFERROR(VLOOKUP(M$19,Fabrics!$C$2:$AR$5001,ROWS(Fabrics!$A$1:G9),FALSE),\"\")","v":""}]
[null,null,null,null,null,{"$f":"IFERROR(INDEX(Fabrics!$C$2:$C$5001,SMALL(IF(F$19=Fabrics!$B$2:$B$5001,MATCH(ROW(Fabrics!$B$2:$B$5001),ROW(Fabrics!$B$2:$B5008)),\"\"),ROWS(Fabrics!$A$1:A8))),\"\")","v":"Icon"},{"$f":"IFERROR(VLOOKUP(G$19,Fabrics!$C$2:$AR$5001,ROWS(Fabrics!$A$1:A10),FALSE),\"\")","v":""},{"$f":"IFERROR(INDEX(Fabrics!$C$2:$C$5001,SMALL(IF(H$19=Fabrics!$B$2:$B$5001,MATCH(ROW(Fabrics!$B$2:$B$5001),ROW(Fabrics!$B$2:$B5008)),\"\"),ROWS(Fabrics!$A$1:D8))),\"\")","v":"Sheerweave4300"},{"$f":"IFERROR(VLOOKUP(I$19,Fabrics!$C$2:$AR$5001,ROWS(Fabrics!$A$1:C10),FALSE),\"\")","v":""},{"$f":"IFERROR(INDEX(Fabrics!$C$2:$C$5001,SMALL(IF(J$19=Fabrics!$B$2:$B$5001,MATCH(ROW(Fabrics!$B$2:$B$5001),ROW(Fabrics!$B$2:$B5008)),\"\"),ROWS(Fabrics!$A$1:E8))),\"\")","v":"Icon"},{"$f":"IFERROR(VLOOKUP(K$19,Fabrics!$C$2:$AR$5001,ROWS(Fabrics!$A$1:E10),FALSE),\"\")","v":""},{"$f":"IFERROR(INDEX(Fabrics!$C$2:$C$5001,SMALL(IF(L$19=Fabrics!$B$2:$B$5001,MATCH(ROW(Fabrics!$B$2:$B$5001),ROW(Fabrics!$B$2:$B5008)),\"\"),ROWS(Fabrics!$A$1:G8))),\"\")","v":"Sheerweave4300"},{"$f":"IFERROR(VLOOKUP(M$19,Fabrics!$C$2:$AR$5001,ROWS(Fabrics!$A$1:G10),FALSE),\"\")","v":""}]
[null,null,null,null,null,{"$f":"IFERROR(INDEX(Fabrics!$C$2:$C$5001,SMALL(IF(F$19=Fabrics!$B$2:$B$5001,MATCH(ROW(Fabrics!$B$2:$B$5001),ROW(Fabrics!$B$2:$B5009)),\"\"),ROWS(Fabrics!$A$1:A9))),\"\")","v":"Icon FR"},{"$f":"IFERROR(VLOOKUP(G$19,Fabrics!$C$2:$AR$5001,ROWS(Fabrics!$A$1:A11),FALSE),\"\")","v":""},{"$f":"IFERROR(INDEX(Fabrics!$C$2:$C$5001,SMALL(IF(H$19=Fabrics!$B$2:$B$5001,MATCH(ROW(Fabrics!$B$2:$B$5001),ROW(Fabrics!$B$2:$B5009)),\"\"),ROWS(Fabrics!$A$1:D9))),\"\")","v":"Sheerweave4500"},{"$f":"IFERROR(VLOOKUP(I$19,Fabrics!$C$2:$AR$5001,ROWS(Fabrics!$A$1:C11),FALSE),\"\")","v":""},{"$f":"IFERROR(INDEX(Fabrics!$C$2:$C$5001,SMALL(IF(J$19=Fabrics!$B$2:$B$5001,MATCH(ROW(Fabrics!$B$2:$B$5001),ROW(Fabrics!$B$2:$B5009)),\"\"),ROWS(Fabrics!$A$1:E9))),\"\")","v":"Icon FR"},{"$f":"IFERROR(VLOOKUP(K$19,Fabrics!$C$2:$AR$5001,ROWS(Fabrics!$A$1:E11),FALSE),\"\")","v":""},{"$f":"IFERROR(INDEX(Fabrics!$C$2:$C$5001,SMALL(IF(L$19=Fabrics!$B$2:$B$5001,MATCH(ROW(Fabrics!$B$2:$B$5001),ROW(Fabrics!$B$2:$B5009)),\"\"),ROWS(Fabrics!$A$1:G9))),\"\")","v":"Sheerweave4500"},{"$f":"IFERROR(VLOOKUP(M$19,Fabrics!$C$2:$AR$5001,ROWS(Fabrics!$A$1:G11),FALSE),\"\")","v":""}]
[null,null,null,null,null,{"$f":"IFERROR(INDEX(Fabrics!$C$2:$C$5001,SMALL(IF(F$19=Fabrics!$B$2:$B$5001,MATCH(ROW(Fabrics!$B$2:$B$5001),ROW(Fabrics!$B$2:$B5010)),\"\"),ROWS(Fabrics!$A$1:A10))),\"\")","v":"Karma"},{"$f":"IFERROR(VLOOKUP(G$19,Fabrics!$C$2:$AR$5001,ROWS(Fabrics!$A$1:A12),FALSE),\"\")","v":""},{"$f":"IFERROR(INDEX(Fabrics!$C$2:$C$5001,SMALL(IF(H$19=Fabrics!$B$2:$B$5001,MATCH(ROW(Fabrics!$B$2:$B$5001),ROW(Fabrics!$B$2:$B5010)),\"\"),ROWS(Fabrics!$A$1:D10))),\"\")","v":"Sheerweave4510"},{"$f":"IFERROR(VLOOKUP(I$19,Fabrics!$C$2:$AR$5001,ROWS(Fabrics!$A$1:C12),FALSE),\"\")","v":""},{"$f":"IFERROR(INDEX(Fabrics!$C$2:$C$5001,SMALL(IF(J$19=Fabrics!$B$2:$B$5001,MATCH(ROW(Fabrics!$B$2:$B$5001),ROW(Fabrics!$B$2:$B5010)),\"\"),ROWS(Fabrics!$A$1:E10))),\"\")","v":"Karma"},{"$f":"IFERROR(VLOOKUP(K$19,Fabrics!$C$2:$AR$5001,ROWS(Fabrics!$A$1:E12),FALSE),\"\")","v":""},{"$f":"IFERROR(INDEX(Fabrics!$C$2:$C$5001,SMALL(IF(L$19=Fabrics!$B$2:$B$5001,MATCH(ROW(Fabrics!$B$2:$B$5001),ROW(Fabrics!$B$2:$B5010)),\"\"),ROWS(Fabrics!$A$1:G10))),\"\")","v":"Sheerweave4510"},{"$f":"IFERROR(VLOOKUP(M$19,Fabrics!$C$2:$AR$5001,ROWS(Fabrics!$A$1:G12),FALSE),\"\")","v":""}]
{"$rows_left_out":30}